{"text_format":"1","workbook":"xlsx","n_sheets":7,"sheets":["Sheet1","INPUT RENTEVOETEN","INPUT LENING","OUTPUT LENING","VERVALDAGEN","ZC-Rentevoeten","Rentevoet analyse"],"not_rendered":{"charts":2,"images":7,"macros":1,"external_links":0,"defined_names":5,"comments":2,"pivot_tables":0},"unopened":[],"bounds":{"document_bytes":16777216,"sheet_cells":100000,"rows_first":2000,"rows_last":500,"rows_between":2000,"halvings":0,"cell_chars":16384,"cell_head_chars":4096},"cells_cut":0,"cells_raw":0,"read":"whole","date_system":"1900"}

{"sheet":"Sheet1","index":0,"n_rows":17,"n_cols":7,"rows_kept":17,"cut":false,"hidden":true,"merged":[[0,0,1,0]]}
["Tenor","EUR Rates 1100",null,{"$f":"NOT(ISNA(MATCH(\"1 Year\",$A$1:$A$17,0)))","v":true},{"$f":"IF($D$1,SUBSTITUTE(SUBSTITUTE(SUBSTITUTE(A1,\"ears\",\"\"),\"ear\",\"\"),\" \",\"\"),\"\")","v":"Tenor"},{"$f":"IF($D$1,INDIRECT(\"E\"&$D$2+ROW()),\"\")","v":"1Y"},{"$f":"IF($D$1,INDIRECT(\"B\"&$D$2+ROW()),\"\")","v":-0.32}]
[null,"2017-11-24",null,{"$f":"IF($D$1,MATCH(\"1Y\",$E$1:$E$17,0)-1,\"\")","v":2},{"$f":"IF($D$1,SUBSTITUTE(SUBSTITUTE(SUBSTITUTE(A2,\"ears\",\"\"),\"ear\",\"\"),\" \",\"\"),\"\")","v":""},{"$f":"IF($D$1,INDIRECT(\"E\"&$D$2+ROW()),\"\")","v":"2Y"},{"$f":"IF($D$1,INDIRECT(\"B\"&$D$2+ROW()),\"\")","v":-0.183}]
["1 Year",-0.32,null,null,"1Y","3Y",-5.8000000000000003E-2]
["2 Years",-0.183,null,null,"2Y","4Y",7.9000000000000001E-2]
["3 Years",-5.8000000000000003E-2,null,null,"3Y","5Y",0.216]
["4 Years",7.9000000000000001E-2,null,null,"4Y","6Y",0.34799999999999998]
["5 Years",0.216,null,null,"5Y","7Y",0.47699999999999998]
["6 Years",0.34799999999999998,null,null,"6Y","8Y",0.60099999999999998]
["7 Years",0.47699999999999998,null,null,"7Y","9Y",0.72]
["8 Years",0.60099999999999998,null,null,"8Y","10Y",0.82899999999999996]
["9 Years",0.72,null,null,"9Y","12Y",1.014]
["10 Years",0.82899999999999996,null,null,"10Y","15Y",1.2150000000000001]
["12 Years",1.014,null,null,"12Y","20Y",1.3959999999999999]
["15 Years",1.2150000000000001,null,null,"15Y","25Y",1.468]
["20 Years",1.3959999999999999,null,null,"20Y","30Y",1.5009999999999999]
{"$rows_left_out":3}
{"sheet":"INPUT RENTEVOETEN","index":1,"n_rows":28,"n_cols":9,"rows_kept":28,"cut":false,"hidden":true,"merged":[]}
["Input marktrentevoeten EUR op basis van :"]
[null,null,null,"de EURIBOR rentevoeten, dagelijks afgebeeld op",null,{"$f":"\"http://www.emmi-benchmarks.eu/assets/modules/rateisblue/file_processing/publication/processed/hist_EURIBOR_\"&YEAR($C$6)&\".xlsx\"","v":"http://www.emmi-benchmarks.eu/assets/modules/rateisblue/file_processing/publication/processed/hist_EURIBOR_2019.xlsx"}]
[null,null,null,"de IRS-ICESWAP rentevoeten, dagelijks afgebeeld op",null,{"$f":"\"https://www.theice.com/marketdata/reports/icebenchmarkadmin/ISDAFIXHistoricalRates.shtml?excelExport=&criteria.reportDate=\"&MONTH($C$6)&\"%2F\"&DAY($C$6)&\"%2F\"&RIGHT(YEAR($C$6),2)&\"&criteria.seriesName=EUR+Rates&criteria.runCode=1100\"","v":"https://www.theice.com/marketdata/reports/icebenchmarkadmin/ISDAFIXHistoricalRates.shtml?excelExport=&criteria.reportDate=1%2F23%2F19&criteria.seriesName=EUR+Rates&criteria.runCode=1100"}]
[]
["Opgelet: altijd alle groene cellen invullen.",null,null,null,null,null,"NL"]
["Marktrentevoeten van",null,"2019-01-23"]
[null,null,"Jaarlijks",null,null,"Gelijkwaardige rentevoet,"]
["Looptijd","Referentie","nominale","Basis",null,"nominaal jaarlijks,","Dagen"]
[null,null,"rentevoet",null,null,"basis 360/360",360]
["1 maand","Euribor",-3.6800000000000001E-3,"365/360",null,{"$f":"ROUND(C10*365/360,5)","v":-3.7299999999999998E-3},30,null,{"$f":"IF(H10=\"\",\"\",H10/100)","v":""}]
["3 maand",{"$f":"B10","v":"Euribor"},-3.0799999999999998E-3,{"$f":"D10","v":"365/360"},null,{"$f":"ROUND(C11*365/360,5)","v":-3.1199999999999999E-3},90,null,""]
["6 maand",{"$f":"B11","v":"Euribor"},-2.3699999999999997E-3,{"$f":"D11","v":"365/360"},null,-2.3999999999999998E-3,180,null,""]
["12 maand",{"$f":"B12","v":"Euribor"},-1.16E-3,{"$f":"D12","v":"365/360"},null,-1.1800000000000001E-3,360,null,""]
["1 jaar","ICE SWAP",-2.8999999999999998E-3,"360/360",null,{"$f":"C14","v":-2.8999999999999998E-3},360,null,{"$f":"IF(H14=\"\",\"\",H14/100)","v":""}]
["2 jaar",{"$f":"B14","v":"ICE SWAP"},-1.56E-3,"360/360",null,-1.56E-3,{"$f":"G14+360","v":720},null,{"$f":"IF(H15=\"\",\"\",H15/100)","v":""}]
{"$rows_left_out":14}
{"sheet":"INPUT LENING","index":2,"n_rows":390,"n_cols":14,"rows_kept":390,"cut":false,"hidden":false,"merged":[[0,2,1,10],[17,2,17,10],[2,2,2,10],[4,6,4,7],[8,7,8,10]]}
[null,null,"Input modaliteiten lening",null,null,null,null,null,null,null,null,"NL"]
[]
[null,null,"Opgelet: enkel de groene cellen invullen aub."]
[null,null,null,null,null,null,null,null,null,null,null,null,null," progressieve tranches"]
[null,null,"Terugbetalingsformule",null,null,null," progressieve tranches",null,null,null,null,null,null," vaste tranches"]
[null,null,"Looptijd",null,null,null,20,"  jaar"]
[null,null,"Periodiciteit betaling intresten en kapitaal",null,null,null,2,"  maal per jaar"]
[null,null,"Periodiciteit betaling kapitaal",null,null,null,{"$f":"G7","v":2},{"$f":"IF(G7<G8,\"     Periodiciteit intrest = minimum periodiciteit kapitaal !!\",\"     maal per jaar\")","v":"     maal per jaar"}]
[null,null,"Herziening van de rentevoet na …",null,null,null,{"$f":"G6","v":20},{"$f":"IF(G9>G6,\" moet kleiner of gelijk aan totale looptijd zijn!!\",IF(G9<1,\" minimum 1 jaar\",\"  jaar\"))","v":"  jaar"},null,null,null,null,null,1]
[{"$f":"IF(DAY(G10)>30,G10-1,G10)","v":{"$error":"#NAME?"}},null,"Omzettingsdatum van het krediet (valutadatum)",null,null,null,{"$f":"endyear()","v":{"$error":"#NAME?"}},{"$f":"IF(G10<sameday(TODAY(),-15),\"  datum verifieren aub\",\" \")","v":{"$error":"#NAME?"}},null,null,null,null,null,2]
[{"$f":"IF(DAY(G11)>30,G11-1,G11)","v":{"$error":"#NAME?"}},null,"1ste vervaldag intrest",null,null,null,{"$f":"IF($G$7=12,VERVALDAGEN!B3,IF($G$7=4,VERVALDAGEN!C3,IF($G$7=2,VERVALDAGEN!D3,VERVALDAGEN!E3)))","v":{"$error":"#NAME?"}},null,null,null,null,null,null,4]
[{"$f":"IF(DAY(G12)>30,G12-1,G12)","v":{"$error":"#NAME?"}},null,"1ste vervaldag kapitaal",null,null,null,{"$f":"IF($G$7=12,VERVALDAGEN!B4,IF('INPUT LENING'!$G$7=4,VERVALDAGEN!C4,IF('INPUT LENING'!$G$7=2,VERVALDAGEN!D4,VERVALDAGEN!E4)))","v":{"$error":"#NAME?"}},null,null,null,null,null,null,12]
[{"$f":"IF(DAY(G13)>30,G13-1,G13)","v":{"$error":"#NAME?"}},null,"Eindvervaldag",null,null,null,{"$f":"endmonth(G12,(G6*12)-(12/G7))","v":{"$error":"#NAME?"}}]
[null,null,{"$f":"IF($G$5=$N$5,\"Aantal kapitaaltranches\",IF($G$8=12,\"Aantal mensualiteiten\",IF($G$8=4,\"Aantal trimestraliteiten\",IF($G$8=2,\"Aantal semestraliteiten\",\"Aantal annuïteiten\"))))","v":"Aantal semestraliteiten"},null,null,null,{"$f":"ROUND(DAYS360($G$12,$G$13,0)/(360/$G$8)+1,0)","v":{"$error":"#NAME?"}}]
[{"$f":"IF(DAY(G15)>30,G15-1,G15)","v":{"$error":"#NAME?"}},null,"Datum 1ste herziening",null,null,null,{"$f":"IF(AND(G9=G6,G6<>1),G13,sameday($G$10,($G$9*12)))","v":{"$error":"#NAME?"}}]
{"$rows_left_out":376}
{"sheet":"OUTPUT LENING","index":3,"n_rows":386,"n_cols":9,"rows_kept":386,"cut":false,"hidden":true,"merged":[[0,0,1,5],[0,6,1,6]]}
["Aflossingstabel op basis van de marktrentevoeten gepubliceerd op ",null,null,null,null,null,{"$f":"'INPUT RENTEVOETEN'!C6","v":"2019-01-23"},"NL"]
[]
[null,null,null,null,"Bron : Euribor en IRS (ICESWAP) rentevoeten",null,null,null,{"$f":"MAX($C$23:$C$383)","v":{"$error":"#NAME?"}}]
["Kredietbedrag",null,null,null,{"$f":"'INPUT LENING'!G16","v":1000000}]
["Terugbetalingsformule",null,null,null,{"$f":"'INPUT LENING'!$G$5","v":" progressieve tranches"}]
["Looptijd",null,null,null,{"$f":"'INPUT LENING'!$G$6","v":20},"jaar"]
["Periodiciteit betaling kapitaal en intresten",null,null,null,{"$f":"'INPUT LENING'!$G$7","v":2},"maal per jaar"]
["Periodiciteit van de interesten",null,null,null,{"$f":"E7","v":2},{"$f":"F7","v":"maal per jaar"}]
["1ste herziening van de rentevoet na …",null,null,null,{"$f":"'INPUT LENING'!$G$9","v":20},{"$f":"F6","v":"jaar"}]
["Omzettingsdatum van het krediet (valutadatum)",null,null,null,{"$f":"'INPUT LENING'!$G$10","v":{"$error":"#NAME?"}}]
["1ste vervaldag intrest",null,null,null,{"$f":"'INPUT LENING'!$G$11","v":{"$error":"#NAME?"}}]
["1ste vervaldag kapitaal",null,null,null,{"$f":"'INPUT LENING'!$G$12","v":{"$error":"#NAME?"}}]
["Eindvervaldag",null,null,null,{"$f":"'INPUT LENING'!$G$13","v":{"$error":"#NAME?"}}]
[{"$f":"'INPUT LENING'!C14","v":"Aantal semestraliteiten"},null,null,{"$f":"ROUND(DAYS360($E$12,$E$13,0)/(360/$E$7)+1,0)","v":{"$error":"#NAME?"}},{"$f":"ROUND(IF($E$5='INPUT LENING'!$N$5,$E$4/$D$14,PMT($E$16/$E$7,$D$14,-$E$4)),2)","v":{"$error":"#NAME?"}}]
["Datum 1ste herziening",null,null,null,{"$f":"IF('INPUT LENING'!G15=E13,\"Geen herziening\",'INPUT LENING'!G15)","v":{"$error":"#NAME?"}}]
{"$rows_left_out":372}
{"sheet":"VERVALDAGEN","index":4,"n_rows":42,"n_cols":5,"rows_kept":42,"cut":false,"hidden":true,"merged":[]}
[null,{"$f":"'INPUT LENING'!G10","v":{"$error":"#NAME?"}}]
[null,"Maandelijks","Trimestriëel","Semestriëel","jaarlijks"]
[null,{"$f":"IF(endmonth(LOOKUP($B$1,B$6:B$42),1)-1=$B$1,endmonth(LOOKUP($B$1,B$6:B$42),2),endmonth(LOOKUP($B$1,B$6:B$42),1))","v":{"$error":"#NAME?"}},{"$f":"IF(endmonth(LOOKUP($B$1,C$6:C$42),3)-1=$B$1,endmonth(LOOKUP($B$1,C$6:C$42),6),endmonth(LOOKUP($B$1,C$6:C$42),3))","v":{"$error":"#NAME?"}},{"$f":"IF(endmonth(LOOKUP($B$1,D$6:D$42),6)-1=$B$1,endmonth(LOOKUP($B$1,D$6:D$42),12),endmonth(LOOKUP($B$1,D$6:D$42),6))","v":{"$error":"#NAME?"}},{"$f":"IF(endmonth(LOOKUP($B$1,E$6:E$42),12)-1=$B$1,endmonth(LOOKUP($B$1,E$6:E$42),24),endmonth(LOOKUP($B$1,E$6:E$42),12))","v":{"$error":"#NAME?"}}]
[null,{"$f":"LOOKUP(endmonth(B3,1),B$7:B$42)","v":{"$error":"#NAME?"}},{"$f":"LOOKUP(endmonth(C3,3),C$7:C$42)","v":{"$error":"#NAME?"}},{"$f":"LOOKUP(endmonth(D3,6),D$7:D$42)","v":{"$error":"#NAME?"}},{"$f":"LOOKUP(endmonth(E3,12),E$7:E$42)","v":{"$error":"#NAME?"}}]
[]
[null,{"$f":"DATE(YEAR($B$1),1,1)-1","v":{"$error":"#NAME?"}},{"$f":"DATE(YEAR($B$1),1,1)-1","v":{"$error":"#NAME?"}},{"$f":"DATE(YEAR($B$1),1,1)-1","v":{"$error":"#NAME?"}},{"$f":"DATE(YEAR($B$1),1,1)-1","v":{"$error":"#NAME?"}}]
[null,{"$f":"endmonth(B6,1)","v":{"$error":"#NAME?"}}]
[null,{"$error":"#NAME?"}]
[null,{"$error":"#NAME?"},{"$f":"B9","v":{"$error":"#NAME?"}}]
[null,{"$error":"#NAME?"}]
[null,{"$error":"#NAME?"}]
[null,{"$error":"#NAME?"},{"$f":"B12","v":{"$error":"#NAME?"}},{"$f":"C12","v":{"$error":"#NAME?"}}]
[null,{"$error":"#NAME?"}]
[null,{"$error":"#NAME?"}]
[null,{"$error":"#NAME?"},{"$f":"B15","v":{"$error":"#NAME?"}}]
{"$rows_left_out":28}
{"sheet":"ZC-Rentevoeten","index":5,"n_rows":47,"n_cols":11,"rows_kept":47,"cut":false,"hidden":true,"merged":[]}
["Month/Years","nDays360","Rates360","Missing tenors",null,"ZC","DF",null,8,true,"C"]
["0D",0,{"$f":"IF(ISNA(MATCH($B2,'INPUT RENTEVOETEN'!$G$10:$G$28,0)),\"\",INDIRECT(\"'INPUT RENTEVOETEN'!F\"&MATCH($B2,'INPUT RENTEVOETEN'!$G$10:$G$28,0)+9))","v":""},{"$f":"D3-(D4-D3)","v":{"$error":"#NAME?"}},null,{"$f":"D2","v":{"$error":"#NAME?"}},{"$f":"IF($F2=\"\",\"\",ROUND(1/(1+$F2)^($B2/360),$I$1))","v":{"$error":"#NAME?"}}]
[{"$f":"IF(B3<360,B3/30&\"M\",B3/360&\"Y\")","v":"1M"},30,{"$f":"IF(ISNA(MATCH($B3,'INPUT RENTEVOETEN'!$G$10:$G$28,0)),\"\",INDIRECT(\"'INPUT RENTEVOETEN'!F\"&MATCH($B3,'INPUT RENTEVOETEN'!$G$10:$G$28,0)+9))","v":-3.7299999999999998E-3},{"$f":"cspline($B$2:$B$47,$C$2:$C$47,$B3,$K$1,$I$1,$J$1)","v":{"$error":"#NAME?"}},null,{"$f":"ROUND((1+$D3*$B3/360)^(360/$B3)-1,$I$1)","v":{"$error":"#NAME?"}},{"$f":"IF($F3=\"\",\"\",ROUND(1/(1+$F3)^($B3/360),$I$1))","v":{"$error":"#NAME?"}}]
[{"$f":"IF(B4<360,B4/30&\"M\",B4/360&\"Y\")","v":"2M"},{"$f":"B3+30","v":60},{"$f":"IF(ISNA(MATCH($B4,'INPUT RENTEVOETEN'!$G$10:$G$28,0)),\"\",INDIRECT(\"'INPUT RENTEVOETEN'!F\"&MATCH($B4,'INPUT RENTEVOETEN'!$G$10:$G$28,0)+9))","v":""},{"$f":"cspline($B$2:$B$47,$C$2:$C$47,$B4,$K$1,$I$1,$J$1)","v":{"$error":"#NAME?"}},null,{"$f":"ROUND((1+$D4*$B4/360)^(360/$B4)-1,$I$1)","v":{"$error":"#NAME?"}},{"$f":"IF($F4=\"\",\"\",ROUND(1/(1+$F4)^($B4/360),$I$1))","v":{"$error":"#NAME?"}}]
["3M",{"$f":"B4+30","v":90},{"$f":"IF(ISNA(MATCH($B5,'INPUT RENTEVOETEN'!$G$10:$G$28,0)),\"\",INDIRECT(\"'INPUT RENTEVOETEN'!F\"&MATCH($B5,'INPUT RENTEVOETEN'!$G$10:$G$28,0)+9))","v":-3.1199999999999999E-3},{"$error":"#NAME?"},null,{"$error":"#NAME?"},{"$error":"#NAME?"}]
["4M",120,{"$f":"IF(ISNA(MATCH($B6,'INPUT RENTEVOETEN'!$G$10:$G$28,0)),\"\",INDIRECT(\"'INPUT RENTEVOETEN'!F\"&MATCH($B6,'INPUT RENTEVOETEN'!$G$10:$G$28,0)+9))","v":""},{"$error":"#NAME?"},null,{"$error":"#NAME?"},{"$error":"#NAME?"}]
["5M",150,{"$f":"IF(ISNA(MATCH($B7,'INPUT RENTEVOETEN'!$G$10:$G$28,0)),\"\",INDIRECT(\"'INPUT RENTEVOETEN'!F\"&MATCH($B7,'INPUT RENTEVOETEN'!$G$10:$G$28,0)+9))","v":""},{"$error":"#NAME?"},null,{"$error":"#NAME?"},{"$error":"#NAME?"}]
["6M",180,{"$f":"IF(ISNA(MATCH($B8,'INPUT RENTEVOETEN'!$G$10:$G$28,0)),\"\",INDIRECT(\"'INPUT RENTEVOETEN'!F\"&MATCH($B8,'INPUT RENTEVOETEN'!$G$10:$G$28,0)+9))","v":-2.3999999999999998E-3},{"$error":"#NAME?"},null,{"$error":"#NAME?"},{"$error":"#NAME?"}]
["7M",210,{"$f":"IF(ISNA(MATCH($B9,'INPUT RENTEVOETEN'!$G$10:$G$28,0)),\"\",INDIRECT(\"'INPUT RENTEVOETEN'!F\"&MATCH($B9,'INPUT RENTEVOETEN'!$G$10:$G$28,0)+9))","v":""},{"$error":"#NAME?"},null,{"$error":"#NAME?"},{"$error":"#NAME?"}]
["8M",240,{"$f":"IF(ISNA(MATCH($B10,'INPUT RENTEVOETEN'!$G$10:$G$28,0)),\"\",INDIRECT(\"'INPUT RENTEVOETEN'!F\"&MATCH($B10,'INPUT RENTEVOETEN'!$G$10:$G$28,0)+9))","v":""},{"$error":"#NAME?"},null,{"$error":"#NAME?"},{"$error":"#NAME?"}]
["9M",270,{"$f":"IF(ISNA(MATCH($B11,'INPUT RENTEVOETEN'!$G$10:$G$28,0)),\"\",INDIRECT(\"'INPUT RENTEVOETEN'!F\"&MATCH($B11,'INPUT RENTEVOETEN'!$G$10:$G$28,0)+9))","v":""},{"$error":"#NAME?"},null,{"$error":"#NAME?"},{"$error":"#NAME?"}]
["10M",300,{"$f":"IF(ISNA(MATCH($B12,'INPUT RENTEVOETEN'!$G$10:$G$28,0)),\"\",INDIRECT(\"'INPUT RENTEVOETEN'!F\"&MATCH($B12,'INPUT RENTEVOETEN'!$G$10:$G$28,0)+9))","v":""},{"$error":"#NAME?"},null,{"$error":"#NAME?"},{"$error":"#NAME?"}]
["11M",330,{"$f":"IF(ISNA(MATCH($B13,'INPUT RENTEVOETEN'!$G$10:$G$28,0)),\"\",INDIRECT(\"'INPUT RENTEVOETEN'!F\"&MATCH($B13,'INPUT RENTEVOETEN'!$G$10:$G$28,0)+9))","v":""},{"$error":"#NAME?"},null,{"$error":"#NAME?"},{"$error":"#NAME?"}]
["12M",{"$f":"B13+30","v":360},{"$f":"'INPUT RENTEVOETEN'!F13","v":-1.1800000000000001E-3},{"$f":"cspline($B$2:$B$47,$C$2:$C$47,$B14,$K$1,$I$1,FALSE)","v":{"$error":"#NAME?"}},null,{"$f":"ROUND((1+$D14*$B14/360)^(360/$B14)-1,$I$1)","v":{"$error":"#NAME?"}},{"$f":"IF($F14=\"\",\"\",ROUND(1/(1+$F14)^($B14/360),$I$1))","v":{"$error":"#NAME?"}}]
["1Y",{"$f":"B14","v":360},{"$f":"'INPUT RENTEVOETEN'!F14","v":-2.8999999999999998E-3},{"$f":"cspline($B$2:$B$47,$C$2:$C$47,$B15,$K$1,$I$1,TRUE)","v":{"$error":"#NAME?"}},null,{"$f":"ROUND((1+$D15*$B15/360)^(360/$B15)-1,$I$1)","v":{"$error":"#NAME?"}},{"$error":"#NAME?"}]
{"$rows_left_out":33}
{"sheet":"Rentevoet analyse","index":6,"n_rows":146,"n_cols":29,"rows_kept":146,"cut":false,"hidden":true,"merged":[]}
["Month/Years","nDays360","Rates360","Missing tenors",null,"ZC","DF",null,8,true,"C",null,null,null,null,null,null,"P","C","L",null,null,null,null,"P","C","L"]
["0D",0,{"$f":"IF(ISNA(MATCH($B2,'INPUT RENTEVOETEN'!$G$10:$G$28,0)),\"\",INDIRECT(\"'INPUT RENTEVOETEN'!F\"&MATCH($B2,'INPUT RENTEVOETEN'!$G$10:$G$28,0)+9))","v":""},{"$f":"D3-(D4-D3)","v":{"$error":"#NAME?"}},null,{"$f":"D2","v":{"$error":"#NAME?"}},{"$f":"IF($F2=\"\",\"\",ROUND(1/(1+$F2)^($B2/360),$I$1))","v":{"$error":"#NAME?"}},null,null,null,null,null,null,null,null,null,"Days","Published","Cubic","Linear","Delta C-L",null,null,"Days","Published","Cubic","Linear","Delta C-L"]
[{"$f":"IF(B3<360,B3/30&\"M\",B3/360&\"Y\")","v":"1M"},30,{"$f":"IF(ISNA(MATCH($B3,'INPUT RENTEVOETEN'!$G$10:$G$28,0)),\"\",INDIRECT(\"'INPUT RENTEVOETEN'!F\"&MATCH($B3,'INPUT RENTEVOETEN'!$G$10:$G$28,0)+9))","v":-3.7299999999999998E-3},{"$f":"cspline($B$2:$B$47,$C$2:$C$47,$B3,$K$1,$I$1,$J$1)","v":{"$error":"#NAME?"}},null,{"$f":"ROUND((1+$D3*$B3/360)^(360/$B3)-1,$I$1)","v":{"$error":"#NAME?"}},{"$f":"IF($F3=\"\",\"\",ROUND(1/(1+$F3)^($B3/360),$I$1))","v":{"$error":"#NAME?"}},null,null,null,null,null,null,null,null,null,0,{"$f":"C3","v":-3.7299999999999998E-3},{"$f":"cspline($Q$3:$Q$146,$R$3:$R$146,$Q3,S$1,5)","v":{"$error":"#NAME?"}},{"$error":"#NAME?"},{"$f":"S3-T3","v":{"$error":"#NAME?"}},{"$f":"IF($Q3<360,IF(MOD($Q3,60)=0,$Q3/30&\" M\",\"\"),IF(MOD($Q3-360,720)=0,$Q3/360&\" Y\",\"\"))","v":"0 M"},null,0,{"$f":"D2","v":{"$error":"#NAME?"}},{"$f":"cspline($X$3:$X$112,$Y$3:$Y$112,$X3,Z$1,5,$J$1)","v":{"$error":"#NAME?"}},{"$f":"cspline($X$3:$X$112,$Y$3:$Y$112,$X3,AA$1,5,$J$1)","v":{"$error":"#NAME?"}},{"$f":"Z3-AA3","v":{"$error":"#NAME?"}},{"$f":"IF(MOD($X3,30)=0,$X3/30&\" M\",\"\")","v":"0 M"}]
[{"$f":"IF(B4<360,B4/30&\"M\",B4/360&\"Y\")","v":"2M"},{"$f":"B3+30","v":60},{"$f":"IF(ISNA(MATCH($B4,'INPUT RENTEVOETEN'!$G$10:$G$28,0)),\"\",INDIRECT(\"'INPUT RENTEVOETEN'!F\"&MATCH($B4,'INPUT RENTEVOETEN'!$G$10:$G$28,0)+9))","v":""},{"$f":"cspline($B$2:$B$47,$C$2:$C$47,$B4,$K$1,$I$1,$J$1)","v":{"$error":"#NAME?"}},null,{"$f":"ROUND((1+$D4*$B4/360)^(360/$B4)-1,$I$1)","v":{"$error":"#NAME?"}},{"$f":"IF($F4=\"\",\"\",ROUND(1/(1+$F4)^($B4/360),$I$1))","v":{"$error":"#NAME?"}},null,null,null,null,null,null,null,null,null,{"$f":"Q3+IF(Q3>=360,90,15)","v":15},{"$f":"IF(ISNA(MATCH(Q4,$B$1:$B$47,0)),\"\",INDIRECT(\"C\"&MATCH(Q4,$B$1:$B$47,0)))","v":""},{"$error":"#NAME?"},{"$error":"#NAME?"},{"$f":"S4-T4","v":{"$error":"#NAME?"}},{"$f":"IF($Q4<360,IF(MOD($Q4,60)=0,$Q4/30&\" M\",\"\"),IF(MOD($Q4-360,720)=0,$Q4/360&\" Y\",\"\"))","v":""},null,{"$f":"X3+10","v":10},{"$f":"IF(ISNA(MATCH(X4,$B$1:$B$47,0)),\"\",INDIRECT(\"C\"&MATCH(X4,$B$1:$B$47,0)))","v":""},{"$f":"cspline($X$3:$X$112,$Y$3:$Y$112,$X4,Z$1,5,$J$1)","v":{"$error":"#NAME?"}},{"$error":"#NAME?"},{"$f":"Z4-AA4","v":{"$error":"#NAME?"}},{"$f":"IF(MOD($X4,30)=0,$X4/30&\" M\",\"\")","v":""}]
["3M",{"$f":"B4+30","v":90},{"$f":"IF(ISNA(MATCH($B5,'INPUT RENTEVOETEN'!$G$10:$G$28,0)),\"\",INDIRECT(\"'INPUT RENTEVOETEN'!F\"&MATCH($B5,'INPUT RENTEVOETEN'!$G$10:$G$28,0)+9))","v":-3.1199999999999999E-3},{"$error":"#NAME?"},null,{"$error":"#NAME?"},{"$error":"#NAME?"},null,null,null,null,null,null,null,null,null,{"$f":"Q4+IF(Q4>=360,90,15)","v":30},-3.7299999999999998E-3,{"$error":"#NAME?"},{"$error":"#NAME?"},{"$error":"#NAME?"},"",null,{"$f":"X4+10","v":20},"",{"$error":"#NAME?"},{"$error":"#NAME?"},{"$f":"Z5-AA5","v":{"$error":"#NAME?"}},""]
["4M",120,{"$f":"IF(ISNA(MATCH($B6,'INPUT RENTEVOETEN'!$G$10:$G$28,0)),\"\",INDIRECT(\"'INPUT RENTEVOETEN'!F\"&MATCH($B6,'INPUT RENTEVOETEN'!$G$10:$G$28,0)+9))","v":""},{"$error":"#NAME?"},null,{"$error":"#NAME?"},{"$error":"#NAME?"},null,null,null,null,null,null,null,null,null,45,"",{"$error":"#NAME?"},{"$error":"#NAME?"},{"$error":"#NAME?"},"",null,30,-3.7299999999999998E-3,{"$error":"#NAME?"},{"$error":"#NAME?"},{"$error":"#NAME?"},"1 M"]
["5M",150,{"$f":"IF(ISNA(MATCH($B7,'INPUT RENTEVOETEN'!$G$10:$G$28,0)),\"\",INDIRECT(\"'INPUT RENTEVOETEN'!F\"&MATCH($B7,'INPUT RENTEVOETEN'!$G$10:$G$28,0)+9))","v":""},{"$error":"#NAME?"},null,{"$error":"#NAME?"},{"$error":"#NAME?"},null,null,null,null,null,null,null,null,null,60,"",{"$error":"#NAME?"},{"$error":"#NAME?"},{"$error":"#NAME?"},"2 M",null,40,"",{"$error":"#NAME?"},{"$error":"#NAME?"},{"$error":"#NAME?"},""]
["6M",180,{"$f":"IF(ISNA(MATCH($B8,'INPUT RENTEVOETEN'!$G$10:$G$28,0)),\"\",INDIRECT(\"'INPUT RENTEVOETEN'!F\"&MATCH($B8,'INPUT RENTEVOETEN'!$G$10:$G$28,0)+9))","v":-2.3999999999999998E-3},{"$error":"#NAME?"},null,{"$error":"#NAME?"},{"$error":"#NAME?"},null,null,null,null,null,null,null,null,null,75,"",{"$error":"#NAME?"},{"$error":"#NAME?"},{"$error":"#NAME?"},"",null,50,"",{"$error":"#NAME?"},{"$error":"#NAME?"},{"$error":"#NAME?"},""]
["7M",210,{"$f":"IF(ISNA(MATCH($B9,'INPUT RENTEVOETEN'!$G$10:$G$28,0)),\"\",INDIRECT(\"'INPUT RENTEVOETEN'!F\"&MATCH($B9,'INPUT RENTEVOETEN'!$G$10:$G$28,0)+9))","v":""},{"$error":"#NAME?"},null,{"$error":"#NAME?"},{"$error":"#NAME?"},null,null,null,null,null,null,null,null,null,90,-3.1199999999999999E-3,{"$error":"#NAME?"},{"$error":"#NAME?"},{"$error":"#NAME?"},"",null,60,"",{"$error":"#NAME?"},{"$error":"#NAME?"},{"$error":"#NAME?"},"2 M"]
["8M",240,{"$f":"IF(ISNA(MATCH($B10,'INPUT RENTEVOETEN'!$G$10:$G$28,0)),\"\",INDIRECT(\"'INPUT RENTEVOETEN'!F\"&MATCH($B10,'INPUT RENTEVOETEN'!$G$10:$G$28,0)+9))","v":""},{"$error":"#NAME?"},null,{"$error":"#NAME?"},{"$error":"#NAME?"},null,null,null,null,null,null,null,null,null,105,"",{"$error":"#NAME?"},{"$error":"#NAME?"},{"$error":"#NAME?"},"",null,70,"",{"$error":"#NAME?"},{"$error":"#NAME?"},{"$error":"#NAME?"},""]
["9M",270,{"$f":"IF(ISNA(MATCH($B11,'INPUT RENTEVOETEN'!$G$10:$G$28,0)),\"\",INDIRECT(\"'INPUT RENTEVOETEN'!F\"&MATCH($B11,'INPUT RENTEVOETEN'!$G$10:$G$28,0)+9))","v":""},{"$error":"#NAME?"},null,{"$error":"#NAME?"},{"$error":"#NAME?"},null,null,null,null,null,null,null,null,null,120,"",{"$error":"#NAME?"},{"$error":"#NAME?"},{"$error":"#NAME?"},"4 M",null,80,"",{"$error":"#NAME?"},{"$error":"#NAME?"},{"$error":"#NAME?"},""]
["10M",300,{"$f":"IF(ISNA(MATCH($B12,'INPUT RENTEVOETEN'!$G$10:$G$28,0)),\"\",INDIRECT(\"'INPUT RENTEVOETEN'!F\"&MATCH($B12,'INPUT RENTEVOETEN'!$G$10:$G$28,0)+9))","v":""},{"$error":"#NAME?"},null,{"$error":"#NAME?"},{"$error":"#NAME?"},null,null,null,null,null,null,null,null,null,135,"",{"$error":"#NAME?"},{"$error":"#NAME?"},{"$error":"#NAME?"},"",null,90,-3.1199999999999999E-3,{"$error":"#NAME?"},{"$error":"#NAME?"},{"$error":"#NAME?"},"3 M"]
["11M",330,{"$f":"IF(ISNA(MATCH($B13,'INPUT RENTEVOETEN'!$G$10:$G$28,0)),\"\",INDIRECT(\"'INPUT RENTEVOETEN'!F\"&MATCH($B13,'INPUT RENTEVOETEN'!$G$10:$G$28,0)+9))","v":""},{"$error":"#NAME?"},null,{"$error":"#NAME?"},{"$error":"#NAME?"},null,null,null,null,null,null,null,null,null,150,"",{"$error":"#NAME?"},{"$error":"#NAME?"},{"$error":"#NAME?"},"",null,100,"",{"$error":"#NAME?"},{"$error":"#NAME?"},{"$error":"#NAME?"},""]
["12M",{"$f":"B13+30","v":360},{"$f":"'INPUT RENTEVOETEN'!F13","v":-1.1800000000000001E-3},{"$f":"cspline($B$2:$B$47,$C$2:$C$47,$B14,$K$1,$I$1,$J$1)","v":{"$error":"#NAME?"}},null,{"$error":"#NAME?"},{"$error":"#NAME?"},null,null,null,null,null,null,null,null,null,165,"",{"$error":"#NAME?"},{"$error":"#NAME?"},{"$error":"#NAME?"},"",null,110,"",{"$error":"#NAME?"},{"$error":"#NAME?"},{"$error":"#NAME?"},""]
["1Y",{"$f":"B14","v":360},{"$f":"'INPUT RENTEVOETEN'!F14","v":-2.8999999999999998E-3},{"$f":"cspline($B$2:$B$47,$C$2:$C$47,$B15,$K$1,$I$1,$J$1)","v":{"$error":"#NAME?"}},null,{"$error":"#NAME?"},{"$error":"#NAME?"},null,null,null,null,null,null,null,null,null,180,-2.3999999999999998E-3,{"$error":"#NAME?"},{"$error":"#NAME?"},{"$error":"#NAME?"},"6 M",null,120,"",{"$error":"#NAME?"},{"$error":"#NAME?"},{"$error":"#NAME?"},"4 M"]
{"$rows_left_out":131}